BDBM50191687 CHEMBL213384::flavaspidic acid-AB
SMILES CCCC(=O)c1c(O)c(C)c(O)c(CC2C(=O)C(C(C)=O)C(=O)C(C)(C)C2=O)c1O
InChI Key InChIKey=RCOCGNVIADBIBD-UHFFFAOYSA-N
Data  1 IC50
  Tab Delimited (TSV)   2D SDfile   Computed 3D by Vconf -m prep SDfile
Find this compound or compounds like it in BindingDB:
Activity Spreadsheet -- Enzyme Inhibition Constant Data from BindingDB
Found 1 hit for monomerid = 50191687
TargetFatty acid synthase(Homo sapiens (Human))
Korea Research Institute Of Bioscience And Biotechnology
Curated by ChEMBL
LigandPNGBDBM50191687(CHEMBL213384 | flavaspidic acid-AB)
Affinity DataIC50:  2.87E+4nM. Assay description: Inhibition of FAS
In DepthDetails ArticlePubMed