BDBM501924 US11028075, Example 57
SMILES CN(C)[C@H]1C[C@H](CC[C@@H]1Oc1ccc(c(F)c1)S(=O)(=O)Nc1ccncn1)c1cccc(c1)C(F)(F)F
InChI Key InChIKey=JMCNIJUBWDDYTD-HSQYWUDLSA-N
Data  2 IC50
  Tab Delimited (TSV)   2D SDfile   Computed 3D by Vconf -m prep SDfile
Find this compound or compounds like it in BindingDB:
Activity Spreadsheet -- Enzyme Inhibition Constant Data from BindingDB
Found 2 hits for monomerid = 501924
TargetSodium channel protein type 9 subunit alpha(Homo sapiens (Human))
Genentech
US Patent
LigandPNGBDBM501924(US11028075, Example 57)
Affinity DataIC50:  2.59nM. Assay description: The following voltage clamp electrophysiology studies are performed on representative compounds using cells heterologously expressing Nav1.7 or Nav1....
Ligand InfoPC cidPC sid
In DepthDetails US Patent
TargetSodium channel protein type 9 subunit alpha(Homo sapiens (Human))
Genentech
US Patent
LigandPNGBDBM501924(US11028075, Example 57)
Affinity DataIC50:  35.3nM. Assay description: Saturation experiments. A competitive NaV1.7 inhibitor having a methyl group is tritiated. Three tritiums are incorporated in place of methyl hydroge...
Ligand InfoPC cidPC sid
In DepthDetails US Patent