BDBM50193072 CHEMBL3906219
SMILES COCCCn1c(N)c(C(=O)NC2CCCC2)c2nc3ccccc3nc12
InChI Key InChIKey=VNOFYGGJZCEPAH-UHFFFAOYSA-N
Data  2 EC50
  Tab Delimited (TSV)   2D SDfile   Computed 3D by Vconf -m prep SDfile
Find this compound or compounds like it in BindingDB:
Activity Spreadsheet -- Enzyme Inhibition Constant Data from BindingDB
Found 2 hits for monomerid = 50193072
TargetNAD-dependent protein deacetylase sirtuin-1(Homo sapiens (Human))
Sichuan University
Curated by ChEMBL
LigandPNGBDBM50193072(CHEMBL3906219)
Affinity DataEC50: <1.00E+3nM. Assay description: Inhibition of sirtuin 1 (unknown origin)
In DepthDetails ArticlePubMed
TargetNAD-dependent protein deacetylase sirtuin-1(Homo sapiens (Human))
Sichuan University
Curated by ChEMBL
LigandPNGBDBM50193072(CHEMBL3906219)
Affinity DataEC50: <1.00E+3nM. Assay description: Activation of recombinant human SIRT1 assessed as increase in deacetylation of Fluor de Lys-SIRT1-specific substrate after 2 hrs by HTS assay
In DepthDetails ArticlePubMed