BDBM50194338 2-(5-amino-6-(trifluoromethyl)-1H-indol-2-yl)-2-hydroxypropyl 2-(trifluoromethyl)benzoate::CHEMBL376858
SMILES CC(O)(COC(=O)c1ccccc1C(F)(F)F)c1cc2cc(N)c(cc2[nH]1)C(F)(F)F
InChI Key InChIKey=HKGQAXPIWKLDGY-UHFFFAOYSA-N
Data  1 IC50
  Tab Delimited (TSV)   2D SDfile   Computed 3D by Vconf -m prep SDfile
Find this compound or compounds like it in BindingDB:
Activity Spreadsheet -- Enzyme Inhibition Constant Data from BindingDB
Found 1 hit for monomerid = 50194338
TargetAndrogen receptor(Rattus norvegicus (Rat))
Johnson And Johnson Pharmaceutical Research And Development
Curated by ChEMBL
LigandPNGBDBM50194338(2-(5-amino-6-(trifluoromethyl)-1H-indol-2-yl)-2-hy...)
Affinity DataIC50:  4.10E+3nM. Assay description: Displacement of [3H]R1881 from rat androgen receptor
In DepthDetails ArticlePubMed