BDBM50195026 CHEMBL223100::N-(4-(2-(4-propoxyphenoxy)thiazol-5-yl)but-3-yn-2-yl)acetamide
SMILES CCCOc1ccc(Oc2ncc(s2)C#CC(C)NC(C)=O)cc1
InChI Key InChIKey=WMTXYBPCCTYHRF-UHFFFAOYSA-N
Data  4 IC50
  Tab Delimited (TSV)   2D SDfile   Computed 3D by Vconf -m prep SDfile
Find this compound or compounds like it in BindingDB:
Activity Spreadsheet -- Enzyme Inhibition Constant Data from BindingDB
Found 4 hits for monomerid = 50195026
TargetAcetyl-CoA carboxylase 2(Homo sapiens (Human))
Abbott Laboratories
Curated by ChEMBL
LigandPNGBDBM50195026(CHEMBL223100 | N-(4-(2-(4-propoxyphenoxy)thiazol-5...)
Affinity DataIC50:  4nM. Assay description: Inhibition of human recombinant ACC2
In DepthDetails ArticlePubMed
TargetAcetyl-CoA carboxylase 1(Homo sapiens (Human))
Abbott Laboratories
Curated by ChEMBL
LigandPNGBDBM50195026(CHEMBL223100 | N-(4-(2-(4-propoxyphenoxy)thiazol-5...)
Affinity DataIC50:  140nM. Assay description: Inhibition of human recombinant ACC1
In DepthDetails ArticlePubMed
TargetAcetyl-CoA carboxylase 1(Homo sapiens (Human))
Abbott Laboratories
Curated by ChEMBL
LigandPNGBDBM50195026(CHEMBL223100 | N-(4-(2-(4-propoxyphenoxy)thiazol-5...)
Affinity DataIC50:  140nM. Assay description: Inhibition of human recombinant ACC1
In DepthDetails ArticlePubMed
TargetAcetyl-CoA carboxylase 2(Homo sapiens (Human))
Abbott Laboratories
Curated by ChEMBL
LigandPNGBDBM50195026(CHEMBL223100 | N-(4-(2-(4-propoxyphenoxy)thiazol-5...)
Affinity DataIC50:  4nM. Assay description: Inhibition of human recombinant ACC2
In DepthDetails ArticlePubMed