BDBM50196333 2-(3-(3-chloro-4-hydroxy-5-methoxybenzyl)thioureido)-4-(3,4-dimethylphenyl)butyl pivalate::CHEMBL239392
SMILES COc1cc(CNC(=S)NC(CCc2ccc(C)c(C)c2)COC(=O)C(C)(C)C)cc(Cl)c1O
InChI Key InChIKey=KFLZCSLZHWLCHY-UHFFFAOYSA-N
Data  1 KI
  Tab Delimited (TSV)   2D SDfile   Computed 3D by Vconf -m prep SDfile
Find this compound or compounds like it in BindingDB:
Activity Spreadsheet -- Enzyme Inhibition Constant Data from BindingDB
Found 1 hit for monomerid = 50196333
TargetTransient receptor potential cation channel subfamily V member 1(Rattus norvegicus (rat))
Seoul National University
Curated by ChEMBL
LigandPNGBDBM50196333(2-(3-(3-chloro-4-hydroxy-5-methoxybenzyl)thioureid...)
Affinity DataKi:  86nM. Assay description: Displacement of [3H]RTX from rat TRPV1 expressed in CHO cells
In DepthDetails ArticlePubMed