BDBM50196357 2-((3-(2-chloro-4-hydroxy-5-methoxybenzyl)thioureido)methyl)-3-(3,4-dimethylphenyl)propyl pivalate::CHEMBL392702
SMILES COc1cc(CNC(=S)NCC(COC(=O)C(C)(C)C)Cc2ccc(C)c(C)c2)c(Cl)cc1O
InChI Key InChIKey=IPOJRKMDMDAOBK-UHFFFAOYSA-N
Data  1 KI
  Tab Delimited (TSV)   2D SDfile   Computed 3D by Vconf -m prep SDfile
Find this compound or compounds like it in BindingDB:
Activity Spreadsheet -- Enzyme Inhibition Constant Data from BindingDB
Found 1 hit for monomerid = 50196357
TargetTransient receptor potential cation channel subfamily V member 1(Rattus norvegicus (rat))
Seoul National University
Curated by ChEMBL
LigandPNGBDBM50196357(2-((3-(2-chloro-4-hydroxy-5-methoxybenzyl)thiourei...)
Affinity DataKi:  24nM. Assay description: Displacement of [3H]RTX from rat TRPV1 expressed in CHO cells
In DepthDetails ArticlePubMed