BDBM50196362 2-(3-(2-chloro-4-hydroxy-5-methoxybenzyl)thioureido)-3-(4-tert-butylphenyl)propyl pivalate::CHEMBL246444
SMILES COc1cc(CNC(=S)NC(COC(=O)C(C)(C)C)Cc2ccc(cc2)C(C)(C)C)c(Cl)cc1O
InChI Key InChIKey=CCHNNDVXDDTSGU-UHFFFAOYSA-N
Data  1 KI
  Tab Delimited (TSV)   2D SDfile   Computed 3D by Vconf -m prep SDfile
Find this compound or compounds like it in BindingDB:
Activity Spreadsheet -- Enzyme Inhibition Constant Data from BindingDB
Found 1 hit for monomerid = 50196362
TargetTransient receptor potential cation channel subfamily V member 1(Rattus norvegicus (rat))
Seoul National University
Curated by ChEMBL
LigandPNGBDBM50196362(2-(3-(2-chloro-4-hydroxy-5-methoxybenzyl)thioureid...)
Affinity DataKi:  42nM. Assay description: Displacement of [3H]RTX from rat TRPV1 expressed in CHO cells
In DepthDetails ArticlePubMed