BDBM50197438 2-beta-carbomethoxy-3-beta-(3,4-dichlorophenyl)-8-oxo-8-thiabicyclo[3.2.1]octane::CHEMBL228156
SMILES COC(=O)[C@@H]1C2CCC(C[C@@H]1c1ccc(Cl)c(Cl)c1)S2=O
InChI Key InChIKey=MIMHZFDDUBVDSD-HJEQSESFSA-N
Data  2 IC50
  Tab Delimited (TSV)   2D SDfile   Computed 3D by Vconf -m prep SDfile
Find this compound or compounds like it in BindingDB:
Activity Spreadsheet -- Enzyme Inhibition Constant Data from BindingDB
Found 2 hits for monomerid = 50197438
TargetSodium-dependent dopamine transporter(Macaca fascicularis)
Organix
Curated by ChEMBL
LigandPNGBDBM50197438(2-beta-carbomethoxy-3-beta-(3,4-dichlorophenyl)-8-...)
Affinity DataIC50:  5.30nM. Assay description: Displacement of [3H]WIN 35428 from DAT in rhesus monkey caudate-putamen
In DepthDetails ArticlePubMed
TargetSodium-dependent serotonin transporter(Macaca mulatta)
Organix
Curated by ChEMBL
LigandPNGBDBM50197438(2-beta-carbomethoxy-3-beta-(3,4-dichlorophenyl)-8-...)
Affinity DataIC50:  120nM. Assay description: Displacement of [3H]citalopram from SERT in rhesus monkey caudate-putamen
In DepthDetails ArticlePubMed