BDBM50197464 (1R)-2-beta-carbomethoxy-3-beta-(3,4-dichlorophenyl)-8-thiabicyclo[3.2.1]octane::CHEMBL376107
SMILES COC(=O)[C@@H]1[C@@H]2CCC(C[C@@H]1c1ccc(Cl)c(Cl)c1)S2
InChI Key InChIKey=IOQGJGXQSJIUOX-VNTKDNAESA-N
Data  2 IC50
  Tab Delimited (TSV)   2D SDfile   Computed 3D by Vconf -m prep SDfile
Find this compound or compounds like it in BindingDB:
Activity Spreadsheet -- Enzyme Inhibition Constant Data from BindingDB
Found 2 hits for monomerid = 50197464
TargetSodium-dependent dopamine transporter(Macaca fascicularis)
Organix
Curated by ChEMBL
LigandPNGBDBM50197464((1R)-2-beta-carbomethoxy-3-beta-(3,4-dichloropheny...)
Affinity DataIC50:  22nM. Assay description: Displacement of [3H]WIN 35428 from DAT in rhesus monkey caudate-putamen
In DepthDetails ArticlePubMed
TargetSodium-dependent serotonin transporter(Macaca mulatta)
Organix
Curated by ChEMBL
LigandPNGBDBM50197464((1R)-2-beta-carbomethoxy-3-beta-(3,4-dichloropheny...)
Affinity DataIC50:  90nM. Assay description: Displacement of [3H]citalopram from SERT in rhesus monkey caudate-putamen
In DepthDetails ArticlePubMed