BDBM50197790 3-{[2-((E)-{[amino(imino)methyl]hydrazono}methyl)-4-bromophenoxy]methyl}benzoic acid::CHEMBL239153
SMILES [#7]\[#6](-[#7])=[#7]\[#7]=[#6]-c1cc(Br)ccc1-[#8]-[#6]-c1cccc(c1)-[#6](-[#8])=O
InChI Key InChIKey=VTEVXISKMNHGCW-UHFFFAOYSA-N
Data  2 IC50
  Tab Delimited (TSV)   2D SDfile   Computed 3D by Vconf -m prep SDfile
Find this compound or compounds like it in BindingDB:
Activity Spreadsheet -- Enzyme Inhibition Constant Data from BindingDB
Found 2 hits for monomerid = 50197790
TargetC-C chemokine receptor type 5(Homo sapiens (Human))TBA
LigandPNGBDBM50197790(3-{[2-((E)-{[amino(imino)methyl]hydrazono}methyl)-...)
Affinity DataIC50:  3.91E+4nM. Assay description: Antagonist activity at Homo sapiens (human) CCR5 receptor
In DepthDetails Article
TargetC-C chemokine receptor type 5(Homo sapiens (Human))TBA
LigandPNGBDBM50197790(3-{[2-((E)-{[amino(imino)methyl]hydrazono}methyl)-...)
Affinity DataIC50:  3.90E+4nM. Assay description: Displacement of [125I]MIP1alpha from human CCR5/CD4 expressed in HEK293 cells
In DepthDetails ArticlePubMed