BDBM50197975 udp-glucuronic acid
SMILES O[C@@H]1[C@@H](COP([O-])(=O)OP([O-])(=O)O[C@@H]2O[C@H]([C@H](O)[C@@H](O)[C@@H]2O)C(O)=O)O[C@H]([C@@H]1O)n1ccc(=O)[nH]c1=O
InChI Key InChIKey=HDYANYHVCAPMJV-TVUPIXCLSA-L
Data  1 EC50
  Tab Delimited (TSV)   2D SDfile   Computed 3D by Vconf -m prep SDfile
Find this compound or compounds like it in BindingDB:
Activity Spreadsheet -- Enzyme Inhibition Constant Data from BindingDB
Found 1 hit for monomerid = 50197975
TargetP2Y purinoceptor 14(Homo sapiens (Human))
National Institute Of Diabetes And Digestive And Kidney Diseases
Curated by ChEMBL
LigandPNGBDBM50197975(udp-glucuronic acid)
Affinity DataEC50:  370nM. Assay description: Agonist activity at human P2Y14 receptor expressed in COS7 cells assessed as stimulation of PLC
In DepthDetails ArticlePubMed