BDBM50199733 CHEMBL396296::methotrexate gamma-L-phenylalaninehydroxamic acid
SMILES CN(Cc1cnc2nc(N)nc(N)c2n1)c1ccc(cc1)C(=O)N[C@@H](CCC(=O)N[C@@H](Cc1ccccc1)C(=O)NO)C(O)=O
InChI Key InChIKey=QHQOEZXEZMHMER-SFTDATJTSA-N
Data  6 IC50
  Tab Delimited (TSV)   2D SDfile   Computed 3D by Vconf -m prep SDfile
Find this compound or compounds like it in BindingDB:
Activity Spreadsheet -- Enzyme Inhibition Constant Data from BindingDB
Found 6 hits for monomerid = 50199733
Target72 kDa type IV collagenase(Homo sapiens (Human))
Instituto Superior T£Cnico
Curated by ChEMBL
LigandPNGBDBM50199733(CHEMBL396296 | methotrexate gamma-L-phenylalanineh...)
Affinity DataIC50:  6.00E+4nM. Assay description: Inhibition of human recombinant MMP2
In DepthDetails ArticlePubMed
TargetDihydrofolate reductase(Homo sapiens (Human))
Instituto Superior T£Cnico
Curated by ChEMBL
LigandPNGBDBM50199733(CHEMBL396296 | methotrexate gamma-L-phenylalanineh...)
Affinity DataIC50:  170nM. Assay description: Inhibition of DHFR using dihydrofolic acid substrate
In DepthDetails ArticlePubMed
TargetMatrix metalloproteinase-9(Homo sapiens (Human))
Instituto Superior T£Cnico
Curated by ChEMBL
LigandPNGBDBM50199733(CHEMBL396296 | methotrexate gamma-L-phenylalanineh...)
Affinity DataIC50:  1.50E+4nM. Assay description: Inhibition of human recombinant MMP9
In DepthDetails ArticlePubMed
TargetMatrilysin(Homo sapiens (Human))
Instituto Superior T£Cnico
Curated by ChEMBL
LigandPNGBDBM50199733(CHEMBL396296 | methotrexate gamma-L-phenylalanineh...)
Affinity DataIC50:  4.40E+4nM. Assay description: Inhibition of human recombinant MMP7
In DepthDetails ArticlePubMed
TargetMatrix metalloproteinase-14(Homo sapiens (Human))
Instituto Superior T£Cnico
Curated by ChEMBL
LigandPNGBDBM50199733(CHEMBL396296 | methotrexate gamma-L-phenylalanineh...)
Affinity DataIC50:  7.00E+4nM. Assay description: Inhibition of human recombinant MMP14
In DepthDetails ArticlePubMed
TargetDihydrofolate reductase(Homo sapiens (Human))
Instituto Superior T£Cnico
Curated by ChEMBL
LigandPNGBDBM50199733(CHEMBL396296 | methotrexate gamma-L-phenylalanineh...)
Affinity DataIC50:  250nM. Assay description: Inhibition of DHFR using folic acid substrate
In DepthDetails ArticlePubMed