BDBM50206931 3-{4-[4-chloro-1-(4-(methylsulfonyl)phenyl)-1H-imidazol-5-yl]-2-fluorophenoxy}propane-1,2-diyl Dinitrate::CHEMBL373867
SMILES CS(=O)(=O)c1ccc(cc1)-n1cnc(Cl)c1-c1ccc(OCC(CO[N+]([O-])=O)O[N+]([O-])=O)c(F)c1
InChI Key InChIKey=ZIJAAKWZKQPLAE-UHFFFAOYSA-N
Data  2 IC50
  Tab Delimited (TSV)   2D SDfile   Computed 3D by Vconf -m prep SDfile
Find this compound or compounds like it in BindingDB:
Activity Spreadsheet -- Enzyme Inhibition Constant Data from BindingDB
Found 2 hits for monomerid = 50206931
TargetProstaglandin G/H synthase 2(Homo sapiens (Human))
Università
Curated by ChEMBL
LigandPNGBDBM50206931(3-{4-[4-chloro-1-(4-(methylsulfonyl)phenyl)-1H-imi...)
Affinity DataIC50:  7.60E+4nM. Assay description: Activity of COX2 in human heparinized blood assessed as inhibition of LPS-induced PGE2 production after 24 hrs
In DepthDetails ArticlePubMed
TargetProstaglandin G/H synthase 1(Homo sapiens (Human))
Università
Curated by ChEMBL
LigandPNGBDBM50206931(3-{4-[4-chloro-1-(4-(methylsulfonyl)phenyl)-1H-imi...)
Affinity DataIC50: >1.00E+5nM. Assay description: Inhibition of COX1 in human whole blood assessed as TxB2 production after 1 hr
In DepthDetails ArticlePubMed