BDBM50207569 CHEMBL434958::N-[4-(1-methyl-1H-benzoimidazol-2-yl)-benzoyl]-guanidine
SMILES Cn1c(nc2ccccc12)-c1ccc(cc1)C(=O)NC(N)=N
InChI Key InChIKey=IHKXTFJDHLDKKU-UHFFFAOYSA-N
Data  1 IC50
  Tab Delimited (TSV)   2D SDfile   Computed 3D by Vconf -m prep SDfile
Find this compound or compounds like it in BindingDB:
Activity Spreadsheet -- Enzyme Inhibition Constant Data from BindingDB
Found 1 hit for monomerid = 50207569
TargetSodium/hydrogen exchanger 1(Rattus norvegicus)
China Pharmaceutical University
Curated by ChEMBL
LigandPNGBDBM50207569(CHEMBL434958 | N-[4-(1-methyl-1H-benzoimidazol-2-y...)
Affinity DataIC50:  264nM. Assay description: Inhibition of NHE1 in rat platelets by Platelet swelling assay
In DepthDetails ArticlePubMed