BDBM50207928 1-((3-methyl-2,3-dihydrobenzofuran-2-yl)methyl)piperidine::CHEMBL375192
SMILES CC1C(CN2CCCCC2)Oc2ccccc12
InChI Key InChIKey=MMYNKGGNYCLPKO-UHFFFAOYSA-N
Data  1 EC50
  Tab Delimited (TSV)   2D SDfile   Computed 3D by Vconf -m prep SDfile
Find this compound or compounds like it in BindingDB:
Activity Spreadsheet -- Enzyme Inhibition Constant Data from BindingDB
Found 1 hit for monomerid = 50207928
TargetATP-dependent translocase ABCB1(Homo sapiens (Human))
University Of Vienna
Curated by ChEMBL
LigandPNGBDBM50207928(1-((3-methyl-2,3-dihydrobenzofuran-2-yl)methyl)pip...)
Affinity DataEC50:  4.89E+4nM. Assay description: Inhibition of P-glycoprotein expressed in MDR CCRF vcr1000 cells by daunorubicin efflux assay
In DepthDetails ArticlePubMed