BDBM50207951 (2-(3-(diethylamino)-2-hydroxypropoxy)phenyl)(phenyl)methanone::CHEMBL93267::[2-(3-Diethylamino-2-hydroxy-propoxy)-phenyl]-phenyl-methanone
SMILES CCN(CC)CC(O)COc1ccccc1C(=O)c1ccccc1
InChI Key InChIKey=GMNUWTLMPFWNMY-UHFFFAOYSA-N
Data  1 EC50
  Tab Delimited (TSV)   2D SDfile   Computed 3D by Vconf -m prep SDfile
Find this compound or compounds like it in BindingDB:
Activity Spreadsheet -- Enzyme Inhibition Constant Data from BindingDB
Found 1 hit for monomerid = 50207951
TargetATP-dependent translocase ABCB1(Homo sapiens (Human))
University Of Vienna
Curated by ChEMBL
LigandPNGBDBM50207951((2-(3-(diethylamino)-2-hydroxypropoxy)phenyl)(phen...)
Affinity DataEC50:  2.32E+3nM. Assay description: Inhibition of P-glycoprotein expressed in MDR CCRF vcr1000 cells by daunorubicin efflux assay
In DepthDetails ArticlePubMed