BDBM50208527 CHEMBL373526::methyl 2-(6-morpholino-4-oxo-4H-pyran-2-yl)benzoate
SMILES COC(=O)c1ccccc1-c1cc(=O)cc(o1)N1CCOCC1
InChI Key InChIKey=NOHUBHMKBHQSCG-UHFFFAOYSA-N
Data  2 IC50
  Tab Delimited (TSV)   2D SDfile   Computed 3D by Vconf -m prep SDfile
Find this compound or compounds like it in BindingDB:
Activity Spreadsheet -- Enzyme Inhibition Constant Data from BindingDB
Found 2 hits for monomerid = 50208527
TargetSerine-protein kinase ATM(Homo sapiens (Human))
Newcastle University
Curated by ChEMBL
LigandPNGBDBM50208527(CHEMBL373526 | methyl 2-(6-morpholino-4-oxo-4H-pyr...)
Affinity DataIC50: >1.00E+4nM. Assay description: Inhibition of ATM kinase
In DepthDetails ArticlePubMed
TargetDNA-dependent protein kinase catalytic subunit(Homo sapiens (Human))
Newcastle University
Curated by ChEMBL
LigandPNGBDBM50208527(CHEMBL373526 | methyl 2-(6-morpholino-4-oxo-4H-pyr...)
Affinity DataIC50:  1.90E+4nM. Assay description: Inhibition of DNA-PK in HeLa cell nuclear extracts
In DepthDetails ArticlePubMed