BDBM50210395 4-phenyl-1-(phenyl(2-(trifluoromethyl)phenyl)methyl)piperidin-4-ol::CHEMBL228794
SMILES OC1(CCN(CC1)C(c1ccccc1)c1ccccc1C(F)(F)F)c1ccccc1
InChI Key InChIKey=VBFYXOKBNYPBSS-UHFFFAOYSA-N
Data  4 KI
  Tab Delimited (TSV)   2D SDfile   Computed 3D by Vconf -m prep SDfile
Find this compound or compounds like it in BindingDB:
Activity Spreadsheet -- Enzyme Inhibition Constant Data from BindingDB
Found 4 hits for monomerid = 50210395
TargetNociceptin receptor(Homo sapiens (Human))
Schering-Plough Research Institute
Curated by ChEMBL
LigandPNGBDBM50210395(4-phenyl-1-(phenyl(2-(trifluoromethyl)phenyl)methy...)
Affinity DataKi:  12nM. Assay description: Agonist activity at human NOP receptor expressed in CHO cells assessed as stimulation of [35S]GTP-gamma-S binding
In DepthDetails ArticlePubMed
TargetMu-type opioid receptor(Homo sapiens (Human))
Schering-Plough Research Institute
Curated by ChEMBL
LigandPNGBDBM50210395(4-phenyl-1-(phenyl(2-(trifluoromethyl)phenyl)methy...)
Affinity DataKi:  127nM. Assay description: Displacement of [3H]diprenorphine from human MOP receptor expressed in CHO cell membranes
In DepthDetails ArticlePubMed
TargetDelta-type opioid receptor(Homo sapiens (Human))
Schering-Plough Research Institute
Curated by ChEMBL
LigandPNGBDBM50210395(4-phenyl-1-(phenyl(2-(trifluoromethyl)phenyl)methy...)
Affinity DataKi:  1.27E+3nM. Assay description: Displacement of [3H]diprenorphine from human DOP receptor expressed in CHO cell membranes
In DepthDetails ArticlePubMed
TargetKappa-type opioid receptor(Homo sapiens (Human))
Schering-Plough Research Institute
Curated by ChEMBL
LigandPNGBDBM50210395(4-phenyl-1-(phenyl(2-(trifluoromethyl)phenyl)methy...)
Affinity DataKi:  1.36E+3nM. Assay description: Displacement of [3H]diprenorphine from human KOP receptor expressed in CHO cell membranes
In DepthDetails ArticlePubMed