BDBM50210713 CHEMBL394596::ethyl 3-(((2S,3R)-4-(3-methoxybenzylamino)-3-hydroxy-1-phenylbutan-2-yl)carbamoyl)-5-(dipropylcarbamoyl)benzoate
SMILES CCCN(CCC)C(=O)c1cc(cc(c1)C(=O)OCC)C(=O)N[C@@H](Cc1ccccc1)[C@H](O)CNCc1cccc(OC)c1
InChI Key InChIKey=XCFURYZGUYZVSE-AJQTZOPKSA-N
Data  2 IC50
  Tab Delimited (TSV)   2D SDfile   Computed 3D by Vconf -m prep SDfile
Find this compound or compounds like it in BindingDB:
Activity Spreadsheet -- Enzyme Inhibition Constant Data from BindingDB
Found 2 hits for monomerid = 50210713
TargetCathepsin D(Homo sapiens (Human))
Pfizer
Curated by ChEMBL
LigandPNGBDBM50210713(CHEMBL394596 | ethyl 3-(((2S,3R)-4-(3-methoxybenzy...)
Affinity DataIC50:  866nM. Assay description: Inhibition of cathepsin D
In DepthDetails ArticlePubMed
TargetBeta-secretase 1(Homo sapiens (Human))
Pfizer
Curated by ChEMBL
LigandPNGBDBM50210713(CHEMBL394596 | ethyl 3-(((2S,3R)-4-(3-methoxybenzy...)
Affinity DataIC50:  132nM. Assay description: Inhibition of BACE1
In DepthDetails ArticlePubMed