BDBM50211559 CHEMBL230360::ethyl 2-((R)-1-((S)-2-((2-(aminomethyl)-5-chlorobenzyl)carbamoyl)pyrrolidin-1-yl)-4-(4-hydroxyphenyl)-1-oxobutan-2-ylamino)acetate
SMILES CCOC(=O)CN[C@H](CCc1ccc(O)cc1)C(=O)N1CCC[C@H]1C(=O)NCc1cc(Cl)ccc1CN
InChI Key InChIKey=FVYGXQLKUXZGOL-RPWUZVMVSA-N
Data  3 KI
  Tab Delimited (TSV)   2D SDfile   Computed 3D by Vconf -m prep SDfile
Find this compound or compounds like it in BindingDB:
Activity Spreadsheet -- Enzyme Inhibition Constant Data from BindingDB
Found 3 hits for monomerid = 50211559
TargetProthrombin(Homo sapiens (Human))
Curacyte Discovery
Curated by ChEMBL
LigandPNGBDBM50211559(CHEMBL230360 | ethyl 2-((R)-1-((S)-2-((2-(aminomet...)
Affinity DataKi:  3.60nM. Assay description: Inhibition of thrombin
In DepthDetails ArticlePubMed
TargetCoagulation factor X(Homo sapiens (Human))
Curacyte Discovery
Curated by ChEMBL
LigandPNGBDBM50211559(CHEMBL230360 | ethyl 2-((R)-1-((S)-2-((2-(aminomet...)
Affinity DataKi:  17nM. Assay description: Inhibition of factor 10a
In DepthDetails ArticlePubMed
TargetUrokinase-type plasminogen activator(Homo sapiens (Human))
Curacyte Discovery
Curated by ChEMBL
LigandPNGBDBM50211559(CHEMBL230360 | ethyl 2-((R)-1-((S)-2-((2-(aminomet...)
Affinity DataKi: >5.00E+3nM. Assay description: Inhibition of uPA
In DepthDetails ArticlePubMed