BDBM50211837 2-[(1E)-{[2-(4-sulfamoylphenyl)ethyl]imino}methyl]phenyl N-(benzenesulfonyl)carbamate::CHEMBL438693
SMILES NS(=O)(=O)c1ccc(CCN=Cc2ccccc2OC(=O)NS(=O)(=O)c2ccccc2)cc1
InChI Key InChIKey=XGARAXCQUFPNOO-UHFFFAOYSA-N
Data  3 KI
  Tab Delimited (TSV)   2D SDfile   Computed 3D by Vconf -m prep SDfile
Find this compound or compounds like it in BindingDB:
Activity Spreadsheet -- Enzyme Inhibition Constant Data from BindingDB
Found 3 hits for monomerid = 50211837
TargetCarbonic anhydrase 1(Homo sapiens (Human))
Universit£
Curated by ChEMBL
LigandPNGBDBM50211837(2-[(1E)-{[2-(4-sulfamoylphenyl)ethyl]imino}methyl]...)
Affinity DataKi:  4nM. Assay description: Inhibition of human carbonic anhydrase 1
In DepthDetails ArticlePubMed
TargetCarbonic anhydrase 2(Homo sapiens (Human))
Universit£
Curated by ChEMBL
LigandPNGBDBM50211837(2-[(1E)-{[2-(4-sulfamoylphenyl)ethyl]imino}methyl]...)
Affinity DataKi:  5nM. Assay description: Inhibition of human carbonic anhydrase 2
In DepthDetails ArticlePubMed
TargetCarbonic anhydrase 4(Bos taurus (bovine))
Universit£
Curated by ChEMBL
LigandPNGBDBM50211837(2-[(1E)-{[2-(4-sulfamoylphenyl)ethyl]imino}methyl]...)
Affinity DataKi:  11nM. Assay description: Inhibition of bovin carbonic anhydrase 4
In DepthDetails ArticlePubMed