BDBM50212594 CHEMBL13783
SMILES CCSC1=NS(=O)(=O)c2cc(C)cnc2N1Cc1ccc(cc1)-c1ccccc1-c1nn[nH]n1
InChI Key InChIKey=LPIKLYRTVMDFDT-UHFFFAOYSA-N
Data  1 KI
  Tab Delimited (TSV)   2D SDfile   Computed 3D by Vconf -m prep SDfile
Find this compound or compounds like it in BindingDB:
Activity Spreadsheet -- Enzyme Inhibition Constant Data from BindingDB
Found 1 hit for monomerid = 50212594
LigandPNGBDBM50212594(CHEMBL13783)
Affinity DataKi:  0.800nM. Assay description: Binding against Angiotensin II receptor in a radioligand binding assay using [125I]-Sar1-Ile8 angiotensin-II as radioligand in rat adrenal cortical m...
In DepthDetails