BDBM50216364 (3-((1H-imidazol-1-yl)methyl)phenyl)(phenyl)methanone::CHEMBL397728
SMILES O=C(c1ccccc1)c1cccc(Cn2ccnc2)c1
InChI Key InChIKey=NEIDBIJTDWHUDH-UHFFFAOYSA-N
Data  1 IC50
  Tab Delimited (TSV)   2D SDfile   Computed 3D by Vconf -m prep SDfile
Find this compound or compounds like it in BindingDB:
Activity Spreadsheet -- Enzyme Inhibition Constant Data from BindingDB
Found 1 hit for monomerid = 50216364
TargetAromatase(Homo sapiens (Human))
TBA
Curated by ChEMBL
LigandPNGBDBM50216364((3-((1H-imidazol-1-yl)methyl)phenyl)(phenyl)methan...)
Affinity DataIC50:  7.30nM. Assay description: Inhibition of CYP19 in human placental microsomes
In DepthDetails ArticlePubMed