BDBM50216531 5-bromonicotinic acid::CHEMBL247336
SMILES OC(=O)c1cncc(Br)c1
InChI Key InChIKey=FQIUCPGDKPXSLL-UHFFFAOYSA-N
Data  1 IC50  1 EC50
PDB links: 1 PDB ID matches this monomer.
  Tab Delimited (TSV)   2D SDfile   Computed 3D by Vconf -m prep SDfile
Find this compound or compounds like it in BindingDB:
Activity Spreadsheet -- Enzyme Inhibition Constant Data from BindingDB
Found 2 hits for monomerid = 50216531
TargetD-aspartate oxidase(Homo sapiens (Human))
Kitasato University
Curated by ChEMBL
LigandPNGBDBM50216531(5-bromonicotinic acid | CHEMBL247336)
Affinity DataIC50: >1.00E+7nM. Assay description: Inhibition of human recombinant DDO expressed in Escherichia coli BL21(DE3) using D-Asp and D-Ala assessed as 2-oxo acid production after 10 mins by ...
In DepthDetails ArticlePubMed
TargetHydroxycarboxylic acid receptor 2(Homo sapiens (Human))
Arena Pharmaceuticals
Curated by ChEMBL
LigandPNGBDBM50216531(5-bromonicotinic acid | CHEMBL247336)
Affinity DataEC50:  1.36E+4nM. Assay description: Agonist activity at human cloned GPR109a receptor by forskolin-stimulated cAMP production test
In DepthDetails ArticlePubMed