BDBM50216844 CHEMBL437924::ethyl 3-(5-{(1R)-4-cyclohexyl-1-[2-(hydroxyamino)-2-oxoethyl]butyl}-1,2,4-oxadiazol-3-yl)benzoate
SMILES CCOC(=O)c1cccc(c1)-c1noc(n1)[C@H](CCCC1CCCCC1)CC(=O)NO
InChI Key InChIKey=UIJRLXLOQCHECQ-GOSISDBHSA-N
Data  1 IC50
  Tab Delimited (TSV)   2D SDfile   Computed 3D by Vconf -m prep SDfile
Find this compound or compounds like it in BindingDB:
Activity Spreadsheet -- Enzyme Inhibition Constant Data from BindingDB
Found 1 hit for monomerid = 50216844
TargetBone morphogenetic protein 1(Homo sapiens (Human))
Pfizer
Curated by ChEMBL
LigandPNGBDBM50216844(CHEMBL437924 | ethyl 3-(5-{(1R)-4-cyclohexyl-1-[2-...)
Affinity DataIC50:  184nM. Assay description: Inhibition of human procollagen C-proteinase expressed in CHO cells
In DepthDetails ArticlePubMed