BDBM50217791 CHEMBL445669::methyl 4-((4-(2-(4-hydroxybenzyl)-1H-indol-3-yl)-N-(4-((4-aminocyclohexyl)methyl)cyclohexyl)butanamido)methyl)benzoate
SMILES COC(=O)c1ccc(CN(C2CCC(CC3CCC(N)CC3)CC2)C(=O)CCCc2c(Cc3ccc(O)cc3)[nH]c3ccccc23)cc1
InChI Key InChIKey=ALEPAKIZRXGWQO-UHFFFAOYSA-N
Data  4 KI
  Tab Delimited (TSV)   2D SDfile   Computed 3D by Vconf -m prep SDfile
Find this compound or compounds like it in BindingDB:
Activity Spreadsheet -- Enzyme Inhibition Constant Data from BindingDB
Found 4 hits for monomerid = 50217791
TargetMelanocortin receptor 4(Homo sapiens (Human))
Uppsala University
Curated by ChEMBL
LigandPNGBDBM50217791(CHEMBL445669 | methyl 4-((4-(2-(4-hydroxybenzyl)-1...)
Affinity DataKi:  2.70E+3nM. Assay description: Displacement of [125I]NDP-MSH from human recombinant MC4 receptor expressed in Sf9 cells
In DepthDetails ArticlePubMed
TargetMelanocyte-stimulating hormone receptor(Mus musculus)
Uppsala University
Curated by ChEMBL
LigandPNGBDBM50217791(CHEMBL445669 | methyl 4-((4-(2-(4-hydroxybenzyl)-1...)
Affinity DataKi:  4.30E+3nM. Assay description: Displacement of [125I]NDP-MSH from MC1 receptor in mouse B16 cells
In DepthDetails ArticlePubMed
TargetMelanocortin receptor 5(Homo sapiens (Human))
Uppsala University
Curated by ChEMBL
LigandPNGBDBM50217791(CHEMBL445669 | methyl 4-((4-(2-(4-hydroxybenzyl)-1...)
Affinity DataKi:  6.70E+3nM. Assay description: Displacement of [125I]NDP-MSH from human recombinant MC5 receptor expressed in Sf9 cells
In DepthDetails ArticlePubMed
TargetMelanocortin receptor 3(Homo sapiens (Human))
Uppsala University
Curated by ChEMBL
LigandPNGBDBM50217791(CHEMBL445669 | methyl 4-((4-(2-(4-hydroxybenzyl)-1...)
Affinity DataKi:  4.60E+4nM. Assay description: Displacement of [125I]NDP-MSH from human recombinant MC3 receptor expressed in Sf9 cells
In DepthDetails ArticlePubMed