BDBM50219244 4-[4-(benzyloxy)piperidino]butyl-4-chlorobenzoate::CHEMBL389048
SMILES Clc1ccc(cc1)C(=O)OCCCCN1CCC(CC1)OCc1ccccc1
InChI Key InChIKey=ZUARKRNDJKGEIT-UHFFFAOYSA-N
Data  2 IC50
  Tab Delimited (TSV)   2D SDfile   Computed 3D by Vconf -m prep SDfile
Find this compound or compounds like it in BindingDB:
Activity Spreadsheet -- Enzyme Inhibition Constant Data from BindingDB
Found 2 hits for monomerid = 50219244
TargetAcetylcholinesterase(Electrophorus electricus (Electric eel))
Woosuk University
Curated by ChEMBL
LigandPNGBDBM50219244(4-[4-(benzyloxy)piperidino]butyl-4-chlorobenzoate ...)
Affinity DataIC50: >1.00E+5nM. Assay description: Inhibition of Electrophorus electricus AChE by Ellman's method
In DepthDetails ArticlePubMed
TargetCholinesterase(Homo sapiens (Human))
Woosuk University
Curated by ChEMBL
LigandPNGBDBM50219244(4-[4-(benzyloxy)piperidino]butyl-4-chlorobenzoate ...)
Affinity DataIC50:  3.52E+3nM. Assay description: Inhibition of human BChE by Ellman's method
In DepthDetails ArticlePubMed