BDBM50219248 4-[4-(benzyloxy)piperidino]butyl benzoate::CHEMBL228950
SMILES O=C(OCCCCN1CCC(CC1)OCc1ccccc1)c1ccccc1
InChI Key InChIKey=PIHTVJYRMYAPDJ-UHFFFAOYSA-N
Data  2 IC50
  Tab Delimited (TSV)   2D SDfile   Computed 3D by Vconf -m prep SDfile
Find this compound or compounds like it in BindingDB:
Activity Spreadsheet -- Enzyme Inhibition Constant Data from BindingDB
Found 2 hits for monomerid = 50219248
TargetCholinesterase(Homo sapiens (Human))
Woosuk University
Curated by ChEMBL
LigandPNGBDBM50219248(4-[4-(benzyloxy)piperidino]butyl benzoate | CHEMBL...)
Affinity DataIC50:  1.89E+3nM. Assay description: Inhibition of human BChE by Ellman's method
In DepthDetails ArticlePubMed
TargetAcetylcholinesterase(Electrophorus electricus (Electric eel))
Woosuk University
Curated by ChEMBL
LigandPNGBDBM50219248(4-[4-(benzyloxy)piperidino]butyl benzoate | CHEMBL...)
Affinity DataIC50: >1.00E+5nM. Assay description: Inhibition of Electrophorus electricus AChE by Ellman's method
In DepthDetails ArticlePubMed