BDBM50219493 3-bromosalicylic acid::CHEMBL389725
SMILES OC(=O)c1cccc(Br)c1O
InChI Key InChIKey=BHPSQWRVKOPSOQ-UHFFFAOYSA-N
Data  1 IC50
  Tab Delimited (TSV)   2D SDfile   Computed 3D by Vconf -m prep SDfile
Find this compound or compounds like it in BindingDB:
Activity Spreadsheet -- Enzyme Inhibition Constant Data from BindingDB
Found 1 hit for monomerid = 50219493
TargetTyrosine-protein phosphatase non-receptor type 1(Homo sapiens (Human))
Inha University
Curated by ChEMBL
LigandPNGBDBM50219493(3-bromosalicylic acid | CHEMBL389725)
Affinity DataIC50: >1.00E+6nM. Assay description: Inhibition of PTP1B
In DepthDetails ArticlePubMed