BDBM50220194 4'-(trifluoromethyl)-4-biphenylyl carbamate::CHEMBL394512
SMILES NC(=O)Oc1ccc(cc1)-c1ccc(cc1)C(F)(F)F
InChI Key InChIKey=ZIARVUIVYFGYIG-UHFFFAOYSA-N
Data  1 IC50
  Tab Delimited (TSV)   2D SDfile   Computed 3D by Vconf -m prep SDfile
Find this compound or compounds like it in BindingDB:
Activity Spreadsheet -- Enzyme Inhibition Constant Data from BindingDB
Found 1 hit for monomerid = 50220194
TargetKinesin-like protein KIF11(Homo sapiens (Human))
Glaxosmithkline
Curated by ChEMBL
LigandPNGBDBM50220194(4'-(trifluoromethyl)-4-biphenylyl carbamate | CHEM...)
Affinity DataIC50:  716nM. Assay description: Inhibition of human KSP motor domain by ATPase assay
In DepthDetails ArticlePubMed