BDBM50220281 1-((2R,6R)-6-ethyl-1-(4-fluorophenylsulfonyl)piperidin-2-yl)cyclopropyl 4-(1-hydroxy-2-methylpropan-2-yl)piperazine-1-carboxylate::CHEMBL236185
SMILES CC[C@@H]1CCC[C@@H](N1S(=O)(=O)c1ccc(F)cc1)C1(CC1)OC(=O)N1CCN(CC1)C(C)(C)CO
InChI Key InChIKey=ZHHZSKBELFZJRW-IFMALSPDSA-N
Data  2 IC50
  Tab Delimited (TSV)   2D SDfile   Computed 3D by Vconf -m prep SDfile
Find this compound or compounds like it in BindingDB:
Activity Spreadsheet -- Enzyme Inhibition Constant Data from BindingDB
Found 2 hits for monomerid = 50220281
TargetAmyloid-beta precursor protein(Homo sapiens (Human))
Schering-Plough Research Institute
Curated by ChEMBL
LigandPNGBDBM50220281(1-((2R,6R)-6-ethyl-1-(4-fluorophenylsulfonyl)piper...)
Affinity DataIC50:  10nM. Assay description: Inhibition of gamma-secretase assessed as reduction of membrane Abeta40 level
In DepthDetails ArticlePubMed
TargetAmyloid-beta precursor protein(Homo sapiens (Human))
Schering-Plough Research Institute
Curated by ChEMBL
LigandPNGBDBM50220281(1-((2R,6R)-6-ethyl-1-(4-fluorophenylsulfonyl)piper...)
Affinity DataIC50:  25nM. Assay description: Inhibition of gamma-secretase assessed as reduction of cell Abeta40 level
In DepthDetails ArticlePubMed