BDBM50221161 2-benzoyl-8a-benzyl-1,2,3,4,8,8a-hexahydroisoquinolin-6(7H)-one::CHEMBL439025
SMILES O=C(N1CCC2=CC(=O)CCC2(Cc2ccccc2)C1)c1ccccc1
InChI Key InChIKey=GTNLBGMCZKIRIZ-UHFFFAOYSA-N
Data  1 KI
  Tab Delimited (TSV)   2D SDfile   Computed 3D by Vconf -m prep SDfile
Find this compound or compounds like it in BindingDB:
Activity Spreadsheet -- Enzyme Inhibition Constant Data from BindingDB
Found 1 hit for monomerid = 50221161
TargetGlucocorticoid receptor(Homo sapiens (Human))
Corcept Therapeutics
Curated by ChEMBL
LigandPNGBDBM50221161(2-benzoyl-8a-benzyl-1,2,3,4,8,8a-hexahydroisoquino...)
Affinity DataKi: >1.00E+4nM. Assay description: Displacement of [3H]dexamethasone from human glucocorticoid receptor expressed in recombinant baculovirus
In DepthDetails ArticlePubMed