BDBM50221875 2-alpha-acetoxy-6-beta,9-beta-difuroyloxy-1-alpha,4-beta-dihydroxy-dihydro-beta-agarofuran::CHEMBL393419
SMILES CC(=O)O[C@H]1C[C@@](C)(O)[C@]23OC(C)(C)[C@H](C[C@H](OC(=O)c4ccco4)[C@]2(C)[C@H]1O)[C@H]3OC(=O)c1ccco1
InChI Key InChIKey=ZCQXSBNRWUJABD-JCBWYCNPSA-N
Data  1 KI
  Tab Delimited (TSV)   2D SDfile   Computed 3D by Vconf -m prep SDfile
Find this compound or compounds like it in BindingDB:
Activity Spreadsheet -- Enzyme Inhibition Constant Data from BindingDB
Found 1 hit for monomerid = 50221875
TargetATP-dependent translocase ABCB1(Homo sapiens (Human))
Instituto Universitario De Bio-Organica Antonio Gonzalez
Curated by ChEMBL
LigandPNGBDBM50221875(2-alpha-acetoxy-6-beta,9-beta-difuroyloxy-1-alpha,...)
Affinity DataKi:  1.00E+5nM. Assay description: Inhibition of human Pgp-mediated DNR transport in NIH3T3 cells by microplate assay
In DepthDetails ArticlePubMed