BDBM50222096 CHEMBL92648
SMILES Fc1ccc(Sc2nc3CNC(=O)N(c3cc2N2CC3CC2CN3CC2CC2)c2c(Cl)cccc2Cl)c(F)c1
InChI Key InChIKey=KSCQZBDAQWTHKN-UHFFFAOYSA-N
Data  3 IC50
  Tab Delimited (TSV)   2D SDfile   Computed 3D by Vconf -m prep SDfile
Find this compound or compounds like it in BindingDB:
Activity Spreadsheet -- Enzyme Inhibition Constant Data from BindingDB
Found 3 hits for monomerid = 50222096
TargetMitogen-activated protein kinase 11/12/13/14(Homo sapiens (Human))
Merck Research Laboratories
Curated by ChEMBL
LigandPNGBDBM50222096(CHEMBL92648)
Affinity DataIC50:  1.20nM. Assay description: Anti human TNF-alpha activity determined through TNF-alpha release was measured in the supernatants by ELISA
In DepthDetails ArticlePubMed
TargetMitogen-activated protein kinase 13(Mus musculus)
Merck Research Laboratories
Curated by ChEMBL
LigandPNGBDBM50222096(CHEMBL92648)
Affinity DataIC50:  3nM. Assay description: Inhibitory activity against mouse Mitogen-activated protein kinase p38
In DepthDetails ArticlePubMed
TargetMitogen-activated protein kinase 11/12/13/14(Homo sapiens (Human))
Merck Research Laboratories
Curated by ChEMBL
LigandPNGBDBM50222096(CHEMBL92648)
Affinity DataIC50:  51nM. Assay description: Inhibition of LPS-induced release of TNF-alpha from human whole blood
In DepthDetails ArticlePubMed