BDBM50223166 5-phenyl-3-[(4-pyrrolidin-1-ylbut-2-yn-1-yl)oxy]-isoxazole fumarate::CHEMBL428916
SMILES C(Oc1cc(on1)-c1ccccc1)C#CC[NH+]1CCCC1
InChI Key InChIKey=MPPKRGDHLBPVNE-UHFFFAOYSA-O
Data  5 KI
  Tab Delimited (TSV)   2D SDfile   Computed 3D by Vconf -m prep SDfile
Find this compound or compounds like it in BindingDB:
Activity Spreadsheet -- Enzyme Inhibition Constant Data from BindingDB
Found 5 hits for monomerid = 50223166
TargetMuscarinic acetylcholine receptor M3(Homo sapiens (Human))
Universit£
Curated by ChEMBL
LigandPNGBDBM50223166(5-phenyl-3-[(4-pyrrolidin-1-ylbut-2-yn-1-yl)oxy]-i...)
Affinity DataKi:  4.01E+3nM. Assay description: Displacement of [3H]QNB from human muscarinic M3 receptor expressed in CHO cells
In DepthDetails ArticlePubMed
TargetMuscarinic acetylcholine receptor M4(Homo sapiens (Human))
Universit£
Curated by ChEMBL
LigandPNGBDBM50223166(5-phenyl-3-[(4-pyrrolidin-1-ylbut-2-yn-1-yl)oxy]-i...)
Affinity DataKi:  5.48E+3nM. Assay description: Displacement of [3H]QNB from human muscarinic M4 receptor expressed in CHO cells
In DepthDetails ArticlePubMed
TargetMuscarinic acetylcholine receptor M1(Homo sapiens (Human))
Universit£
Curated by ChEMBL
LigandPNGBDBM50223166(5-phenyl-3-[(4-pyrrolidin-1-ylbut-2-yn-1-yl)oxy]-i...)
Affinity DataKi:  6.14E+3nM. Assay description: Displacement of [3H]QNB from human muscarinic M1 receptor expressed in CHO cells
In DepthDetails ArticlePubMed
TargetMuscarinic acetylcholine receptor M5(Homo sapiens (Human))
Universit£
Curated by ChEMBL
LigandPNGBDBM50223166(5-phenyl-3-[(4-pyrrolidin-1-ylbut-2-yn-1-yl)oxy]-i...)
Affinity DataKi:  6.89E+3nM. Assay description: Displacement of [3H]QNB from human muscarinic M5 receptor expressed in CHO cells
In DepthDetails ArticlePubMed
TargetMuscarinic acetylcholine receptor M2(Homo sapiens (Human))
Universit£
Curated by ChEMBL
LigandPNGBDBM50223166(5-phenyl-3-[(4-pyrrolidin-1-ylbut-2-yn-1-yl)oxy]-i...)
Affinity DataKi: >1.00E+4nM. Assay description: Displacement of [3H]QNB from human muscarinic M2 receptor expressed in CHO cells
In DepthDetails ArticlePubMed