BDBM50223962 8-methyl-8-aza-bicyclo[3.2.1]octan-3-yl 4-bromobenzyl(phenyl)carbamate::CHEMBL238175
SMILES CN1C2CCC1CC(C2)OC(=O)N(Cc1ccc(Br)cc1)c1ccccc1
InChI Key InChIKey=BURCDLIOLMBANF-UHFFFAOYSA-N
Data  3 IC50
  Tab Delimited (TSV)   2D SDfile   Computed 3D by Vconf -m prep SDfile
Find this compound or compounds like it in BindingDB:
Activity Spreadsheet -- Enzyme Inhibition Constant Data from BindingDB
Found 3 hits for monomerid = 50223962
TargetMuscarinic acetylcholine receptor M1(Homo sapiens (Human))
Glaxosmithkline
Curated by ChEMBL
LigandPNGBDBM50223962(8-methyl-8-aza-bicyclo[3.2.1]octan-3-yl 4-bromoben...)
Affinity DataIC50:  813nM. Assay description: Antagonist activity at cloned muscarinic M1 receptor expressed in CHO cells by measuring calcium mobilization
In DepthDetails ArticlePubMed
TargetMuscarinic acetylcholine receptor M3(Homo sapiens (Human))
Glaxosmithkline
Curated by ChEMBL
LigandPNGBDBM50223962(8-methyl-8-aza-bicyclo[3.2.1]octan-3-yl 4-bromoben...)
Affinity DataIC50:  721nM. Assay description: Antagonist activity at cloned muscarinic M3 receptor expressed in CHO cells by measuring calcium mobilization
In DepthDetails ArticlePubMed
TargetMuscarinic acetylcholine receptor M2(Homo sapiens (Human))
Glaxosmithkline
Curated by ChEMBL
LigandPNGBDBM50223962(8-methyl-8-aza-bicyclo[3.2.1]octan-3-yl 4-bromoben...)
Affinity DataIC50:  1.42E+3nM. Assay description: Antagonist activity at cloned muscarinic M2 receptor expressed in CHO cells by measuring calcium mobilization
In DepthDetails ArticlePubMed