BDBM50224122 CHEMBL398382::ethyl-2-methyl-5-[4-(methylsulfonyl)phenyl]-1-[4-(methoxy)phenyl]-1H-pyrrol-3-acetate
SMILES CCOC(=O)Cc1cc(-c2ccc(cc2)S(C)(=O)=O)n(c1C)-c1ccc(OC)cc1
InChI Key InChIKey=MAGCWJGJMQCZAE-UHFFFAOYSA-N
Data  2 IC50
  Tab Delimited (TSV)   2D SDfile   Computed 3D by Vconf -m prep SDfile
Find this compound or compounds like it in BindingDB:
Activity Spreadsheet -- Enzyme Inhibition Constant Data from BindingDB
Found 2 hits for monomerid = 50224122
TargetProstaglandin G/H synthase 2(Mus musculus (Mouse))
Sapienza University Of Rome
Curated by ChEMBL
LigandPNGBDBM50224122(CHEMBL398382 | ethyl-2-methyl-5-[4-(methylsulfonyl...)
Affinity DataIC50:  26nM. Assay description: Inhibition of COX2 in LPS-stimulated J774 cells assessed as inhibition of PGE2 levels by radioimmunoassay
In DepthDetails ArticlePubMed
TargetProstaglandin G/H synthase 1(Mus musculus)
Sapienza University Of Rome
Curated by ChEMBL
LigandPNGBDBM50224122(CHEMBL398382 | ethyl-2-methyl-5-[4-(methylsulfonyl...)
Affinity DataIC50: >1.00E+5nM. Assay description: Inhibition of COX1 in mouse J774 cells assessed as arachidonic acid-induced PGE2 levels by radio immunoassay
In DepthDetails ArticlePubMed