BDBM50224167 CHEMBL241553::methyl-m-tolyl-carbamic acid 4-(5-trifluoromethylpyridin-2-yloxy)-phenyl ester
SMILES CN(C(=O)Oc1ccc(Oc2ccc(cn2)C(F)(F)F)cc1)c1cccc(C)c1
InChI Key InChIKey=YSYILNVKBYZTCI-UHFFFAOYSA-N
Data  3 IC50
  Tab Delimited (TSV)   2D SDfile   Computed 3D by Vconf -m prep SDfile
Find this compound or compounds like it in BindingDB:
Activity Spreadsheet -- Enzyme Inhibition Constant Data from BindingDB
Found 3 hits for monomerid = 50224167
TargetCholinesterase(Homo sapiens (Human))
Novo Nordisk
Curated by ChEMBL
LigandPNGBDBM50224167(CHEMBL241553 | methyl-m-tolyl-carbamic acid 4-(5-t...)
Affinity DataIC50: >5.00E+4nM. Assay description: Inhibition of butyrylcholine esterase
In DepthDetails ArticlePubMed
TargetHormone-sensitive lipase(Homo sapiens (Human))
Novo Nordisk
Curated by ChEMBL
LigandPNGBDBM50224167(CHEMBL241553 | methyl-m-tolyl-carbamic acid 4-(5-t...)
Affinity DataIC50:  250nM. Assay description: Inhibition of recombinant human hormone-sensitive lipase
In DepthDetails ArticlePubMed
TargetAcetylcholinesterase(Homo sapiens (Human))
Novo Nordisk
Curated by ChEMBL
LigandPNGBDBM50224167(CHEMBL241553 | methyl-m-tolyl-carbamic acid 4-(5-t...)
Affinity DataIC50: >5.00E+4nM. Assay description: Inhibition of acetylcholine esterase
In DepthDetails ArticlePubMed