BDBM50224509 (E)-methyl 2-(4-(1H-indol-3-yl)piperidin-1-yl)-2-(1-(3-(3,4,5-trifluorophenyl)acryloyl)piperidin-4-yl)acetate::CHEMBL392366::methyl 2-(4-(1H-indol-3-yl)piperidin-1-yl)-2-(1-(3-(3,4,5-trifluorophenyl)acryloyl)piperidin-4-yl)acetate
SMILES COC(=O)C(C1CCN(CC1)C(=O)\C=C\c1cc(F)c(F)c(F)c1)N1CCC(CC1)c1c[nH]c2ccccc12
InChI Key InChIKey=WPVHSRPUAPKWSP-VOTSOKGWSA-N
Data  2 IC50
  Tab Delimited (TSV)   2D SDfile   Computed 3D by Vconf -m prep SDfile
Find this compound or compounds like it in BindingDB:
Activity Spreadsheet -- Enzyme Inhibition Constant Data from BindingDB
Found 2 hits for monomerid = 50224509
TargetC-C chemokine receptor type 2(Homo sapiens (Human))
Johnson & Johnson Pharmaceutical Research And Development
Curated by ChEMBL
LigandPNGBDBM50224509((E)-methyl 2-(4-(1H-indol-3-yl)piperidin-1-yl)-2-(...)
Affinity DataIC50:  3.30E+3nM. Assay description: Binding affinity at human CCR2 receptor
In DepthDetails ArticlePubMed
TargetC-C chemokine receptor type 2(Homo sapiens (Human))
Johnson & Johnson Pharmaceutical Research And Development
Curated by ChEMBL
LigandPNGBDBM50224509((E)-methyl 2-(4-(1H-indol-3-yl)piperidin-1-yl)-2-(...)
Affinity DataIC50:  3.30E+3nM. Assay description: Inhibition of human CCR2
In DepthDetails ArticlePubMed