BDBM50224555 Beta-Fuoxymorphine::CHEMBL413090
SMILES [H][C@]1(CC[C@@]2(O)C3Cc4ccc(O)c5OC1C2(CCN3C)c45)NC(=O)\C=C\C(=O)OC
InChI Key InChIKey=VYGVQURMYFVOPO-AEWANVJFSA-N
Data  1 IC50
  Tab Delimited (TSV)   2D SDfile   Computed 3D by Vconf -m prep SDfile
Find this compound or compounds like it in BindingDB:
Activity Spreadsheet -- Enzyme Inhibition Constant Data from BindingDB
Found 1 hit for monomerid = 50224555
TargetDelta-type/Kappa-type/Mu-type opioid receptor(Homo sapiens (Human))
TBA
Curated by ChEMBL
LigandPNGBDBM50224555(Beta-Fuoxymorphine | CHEMBL413090)
Affinity DataIC50:  22nM. Assay description: Evaluated the ability to protect against the irreversible antagonism of morphines effects by beta-FNA in guinea pig ileal longitudinal muscle.
In DepthDetails ArticlePubMed