BDBM50226144 2,4-Diamino-Butyric Acid::CHEBI:64307::CHEMBL307931::DL-2,4-diaminobutyric acid
SMILES NCCC(N)C(O)=O
InChI Key InChIKey=OGNSCSPNOLGXSM-UHFFFAOYSA-N
Data  1 IC50
PDB links: 13 PDB IDs match this monomer.
  Tab Delimited (TSV)   2D SDfile   Computed 3D by Vconf -m prep SDfile
Find this compound or compounds like it in BindingDB:
Activity Spreadsheet -- Enzyme Inhibition Constant Data from BindingDB
Found 1 hit for monomerid = 50226144
TargetSodium- and chloride-dependent betaine transporter(Rattus norvegicus)
TBA
Curated by ChEMBL
LigandPNGBDBM50226144(2,4-Diamino-Butyric Acid | CHEBI:64307 | CHEMBL307...)
Affinity DataIC50:  2.00E+3nM. Assay description: In vitro inhibition of rat neuronal (synaptosomal) GABA uptake.
In DepthDetails ArticlePubMed