BDBM50226658 CHEMBL237402::phenylmethyl 2-{4-chloro-1-[(4-chlorophenyl)carbonyl]-5-methoxy-2-methylindol-3-yl}acetate
SMILES COc1ccc2n(C(=O)c3ccc(Cl)cc3)c(C)c(CC(=O)OCc3ccccc3)c2c1Cl
InChI Key InChIKey=SQFLZSNZRKFLSM-UHFFFAOYSA-N
Data  1 IC50
  Tab Delimited (TSV)   2D SDfile   Computed 3D by Vconf -m prep SDfile
Find this compound or compounds like it in BindingDB:
Activity Spreadsheet -- Enzyme Inhibition Constant Data from BindingDB
Found 1 hit for monomerid = 50226658
TargetProstaglandin G/H synthase 1(Homo sapiens (Human))
Nitromed
Curated by ChEMBL
LigandPNGBDBM50226658(CHEMBL237402 | phenylmethyl 2-{4-chloro-1-[(4-chlo...)
Affinity DataIC50: >1.00E+5nM. Assay description: Inhibition of COX1 in human whole blood assessed as effect on A23187-induced thromboxane B2 production
In DepthDetails ArticlePubMed