BDBM50227739 2-methyl-2-(2-methyl-4-(3-((2-methyl-4-(trifluoromethoxy)benzamido)methyl)phenoxy)phenoxy)propanoic acid::CHEMBL237305
SMILES Cc1cc(Oc2cccc(CNC(=O)c3ccc(OC(F)(F)F)cc3C)c2)ccc1OC(C)(C)C(O)=O
InChI Key InChIKey=PMPUQJLQCPEQEM-UHFFFAOYSA-N
Data  6 IC50  3 EC50
  Tab Delimited (TSV)   2D SDfile   Computed 3D by Vconf -m prep SDfile
Find this compound or compounds like it in BindingDB:
Activity Spreadsheet -- Enzyme Inhibition Constant Data from BindingDB
Found 9 hits for monomerid = 50227739
TargetPeroxisome proliferator-activated receptor delta(Homo sapiens (Human))
Eli Lilly
Curated by ChEMBL
LigandPNGBDBM50227739(2-methyl-2-(2-methyl-4-(3-((2-methyl-4-(trifluorom...)
Affinity DataIC50:  54nM. Assay description: Displacement of [3H]-2-(4-{2-[3-(2,4-difluoro-phenyl)-1-heptyl-ureido]-ethyl}-phenoxy)-2-methyl-butyric acid from human PPARdelta
In DepthDetails ArticlePubMed
TargetPeroxisome proliferator-activated receptor delta(Homo sapiens (Human))
Eli Lilly
Curated by ChEMBL
LigandPNGBDBM50227739(2-methyl-2-(2-methyl-4-(3-((2-methyl-4-(trifluorom...)
Affinity DataEC50:  50nM. Assay description: Agonist activity at human PPARdelta expressed in CV1 cells by receptor transactivation assay
In DepthDetails ArticlePubMed
TargetPeroxisome proliferator-activated receptor alpha(Homo sapiens (Human))
Eli Lilly
Curated by ChEMBL
LigandPNGBDBM50227739(2-methyl-2-(2-methyl-4-(3-((2-methyl-4-(trifluorom...)
Affinity DataEC50:  420nM. Assay description: Agonist activity at human PPARalpha expressed in CV1 cells by receptor transactivation assay
In DepthDetails ArticlePubMed
TargetPeroxisome proliferator-activated receptor alpha(Homo sapiens (Human))
Eli Lilly
Curated by ChEMBL
LigandPNGBDBM50227739(2-methyl-2-(2-methyl-4-(3-((2-methyl-4-(trifluorom...)
Affinity DataIC50:  4.85E+3nM. Assay description: Displacement of [3H]-2-(4-{2-[3-(2,4-difluoro-phenyl)-1-heptyl-ureido]-ethyl}-phenoxy)-2-methyl-butyric acid from human PPARalpha
In DepthDetails ArticlePubMed
TargetPeroxisome proliferator-activated receptor delta(Homo sapiens (Human))
Eli Lilly
Curated by ChEMBL
LigandPNGBDBM50227739(2-methyl-2-(2-methyl-4-(3-((2-methyl-4-(trifluorom...)
Affinity DataIC50:  54.0nM. Assay description: Agonist activity at PPARdelta
In DepthDetails ArticlePubMed
TargetPeroxisome proliferator-activated receptor gamma(Homo sapiens (Human))
Eli Lilly
Curated by ChEMBL
LigandPNGBDBM50227739(2-methyl-2-(2-methyl-4-(3-((2-methyl-4-(trifluorom...)
Affinity DataEC50:  10nM. Assay description: Agonist activity at human PPARgamma expressed in CV1 cells by receptor transactivation assay
In DepthDetails ArticlePubMed
TargetPeroxisome proliferator-activated receptor alpha(Homo sapiens (Human))
Eli Lilly
Curated by ChEMBL
LigandPNGBDBM50227739(2-methyl-2-(2-methyl-4-(3-((2-methyl-4-(trifluorom...)
Affinity DataIC50:  4.85E+3nM. Assay description: Agonist activity at PPARalpha
In DepthDetails ArticlePubMed
TargetPeroxisome proliferator-activated receptor gamma(Homo sapiens (Human))
Eli Lilly
Curated by ChEMBL
LigandPNGBDBM50227739(2-methyl-2-(2-methyl-4-(3-((2-methyl-4-(trifluorom...)
Affinity DataIC50:  47.0nM. Assay description: Agonist activity at PPARgamma
In DepthDetails ArticlePubMed
TargetPeroxisome proliferator-activated receptor gamma(Homo sapiens (Human))
Eli Lilly
Curated by ChEMBL
LigandPNGBDBM50227739(2-methyl-2-(2-methyl-4-(3-((2-methyl-4-(trifluorom...)
Affinity DataIC50:  47nM. Assay description: Displacement of [3H]-2-methyl-2-(4-{3-{propyl-(5-pyridin-2-yl-thiophene-2-sulfonyl)-amino}-propyl}-phenoxy)-propionic acid from human PPARgamma
In DepthDetails ArticlePubMed