BDBM50235096 CHEMBL255011::methyl 2-(2-(2-phenylbicyclo[2.2.1]heptan-2-yl)-5-(quinolin-2-ylmethoxy)phenoxy)acetate
SMILES COC(=O)COc1cc(OCc2ccc3ccccc3n2)ccc1C1(CC2CCC1C2)c1ccccc1
InChI Key InChIKey=KSMDTIMUUSFGOY-UHFFFAOYSA-N
Data  1 IC50
  Tab Delimited (TSV)   2D SDfile   Computed 3D by Vconf -m prep SDfile
Find this compound or compounds like it in BindingDB:
Activity Spreadsheet -- Enzyme Inhibition Constant Data from BindingDB
Found 1 hit for monomerid = 50235096
TargetArachidonate 5-lipoxygenase-activating protein(Homo sapiens (Human))
Merck Frosst Centre For Therapeutic Research
Curated by ChEMBL
LigandPNGBDBM50235096(CHEMBL255011 | methyl 2-(2-(2-phenylbicyclo[2.2.1]...)
Affinity DataIC50:  776nM. Assay description: Displacement of [125I]L-691831 from FLAP
In DepthDetails ArticlePubMed