BDBM50239189 CHEMBL4082668
SMILES Fc1ccc2c(Cc3c[nH]c4cc(F)ccc34)c[nH]c2c1
InChI Key InChIKey=IBGKQBDEKQHWGJ-UHFFFAOYSA-N
Data  3 EC50
  Tab Delimited (TSV)   2D SDfile   Computed 3D by Vconf -m prep SDfile
Find this compound or compounds like it in BindingDB:
Activity Spreadsheet -- Enzyme Inhibition Constant Data from BindingDB
Found 3 hits for monomerid = 50239189
TargetG-protein coupled receptor 84(Homo sapiens (Human))
University of Bonn
Curated by ChEMBL
LigandPNGBDBM50239189(CHEMBL4082668)
Affinity DataEC50:  625nM. Assay description: Agonist activity at Gi coupled human GPR84 expressed in CHO cells assessed as inhibition of forskolin-induced cAMP accumulation after 15 mins in pres...
In DepthDetails ArticlePubMed
TargetG-protein coupled receptor 84(Homo sapiens (Human))
University of Bonn
Curated by ChEMBL
LigandPNGBDBM50239189(CHEMBL4082668)
Affinity DataEC50:  302nM. Assay description: Positive allosteric modulation of recombinant human GPR84 expressed in CHO cell membranes co-expressing beta-arrestin2 assessed as increase in [3H]PS...
In DepthDetails ArticlePubMed
TargetG-protein coupled receptor 84(Homo sapiens (Human))
University of Bonn
Curated by ChEMBL
LigandPNGBDBM50239189(CHEMBL4082668)
Affinity DataEC50:  7.53E+3nM. Assay description: Agonist activity at human GPR84 expressed in CHO cells assessed as beta-arrestin recruitment after 90 mins by beta-galactosidase complementation assa...
In DepthDetails ArticlePubMed