BDBM50240022 Salcaprozic Acid
SMILES OC(=O)CCCCCCCNC(=O)c1ccccc1O
InChI Key InChIKey=NJEKDCUDSORUJA-UHFFFAOYSA-N
Data  1 IC50
  Tab Delimited (TSV)   2D SDfile   Computed 3D by Vconf -m prep SDfile
Find this compound or compounds like it in BindingDB:
Activity Spreadsheet -- Enzyme Inhibition Constant Data from BindingDB
Found 1 hit for monomerid = 50240022
TargetBile salt export pump(Homo sapiens (Human))
Astrazeneca
Curated by ChEMBL
LigandPNGBDBM50240022(Salcaprozic Acid)
Affinity DataIC50: >7.51E+5nM. Assay description: Inhibition of human BSEP expressed in baculovirus transfected fall armyworm Sf21 cell membranes vesicles assessed as reduction in ATP-dependent [3H]-...
In DepthDetails ArticlePubMed