BDBM50240091 Crotamiton::Crotan::Eurax
SMILES CCN(C(=O)\C=C\C)c1ccccc1C
InChI Key InChIKey=DNTGGZPQPQTDQF-XBXARRHUSA-N
Data  1 IC50
  Tab Delimited (TSV)   2D SDfile   Computed 3D by Vconf -m prep SDfile
Find this compound or compounds like it in BindingDB:
Activity Spreadsheet -- Enzyme Inhibition Constant Data from BindingDB
Found 1 hit for monomerid = 50240091
TargetBile salt export pump(Homo sapiens (Human))
Astrazeneca
Curated by ChEMBL
LigandPNGBDBM50240091(Crotamiton | Crotan | Eurax)
Affinity DataIC50:  1.10E+5nM. Assay description: Inhibition of human BSEP expressed in baculovirus transfected fall armyworm Sf21 cell membranes vesicles assessed as reduction in ATP-dependent [3H]-...
In DepthDetails ArticlePubMed