BDBM50240728 Acetic acid 4-allyl-2-methoxy-phenyl ester::CHEMBL108299::eugenyl acetate
SMILES COc1cc(CC=C)ccc1OC(C)=O
InChI Key InChIKey=SCCDQYPEOIRVGX-UHFFFAOYSA-N
Data  1 IC50
  Tab Delimited (TSV)   2D SDfile   Computed 3D by Vconf -m prep SDfile
Find this compound or compounds like it in BindingDB:
Activity Spreadsheet -- Enzyme Inhibition Constant Data from BindingDB
Found 1 hit for monomerid = 50240728
TargetProstaglandin G/H synthase 1(Homo sapiens (Human))
Uppsala University
Curated by ChEMBL
LigandPNGBDBM50240728(Acetic acid 4-allyl-2-methoxy-phenyl ester | CHEMB...)
Affinity DataIC50:  3.00E+3nM. Assay description: Inhibition of COX1
In DepthDetails ArticlePubMed