BDBM50128052 Allyl-{6-[4-(6-bromo-benzo[d]isothiazol-3-yl)-phenoxy]-hexyl}-methyl-amine::CHEMBL112553::CHEMBL294809::N-allyl-6-(4-(6-bromobenzo[d]isothiazol-3-yl)phenoxy)-N-methylhexan-1-aminium::N-{6-[4-(6-BROMO-1,2-BENZISOTHIAZOL-3-YL)PHENOXY]HEXYL}-N-METHYL-2-PROPEN-1-AMINE
SMILES CN(CCCCCCOc1ccc(cc1)-c1nsc2cc(Br)ccc12)CC=C
InChI Key InChIKey=ZHDHSBKTLRLUCQ-UHFFFAOYSA-N
Data  7 IC50
PDB links: 1 PDB ID matches this monomer.
  Tab Delimited (TSV)   2D SDfile   Computed 3D by Vconf -m prep SDfile
Find this compound or compounds like it in BindingDB:
Activity Spreadsheet -- Enzyme Inhibition Constant Data from BindingDB
Found 7 hits for monomerid = 50128052
TargetLanosterol synthase(Homo sapiens (Human))
Albert-Ludwigs-University Of Freiburg
Curated by ChEMBL
LigandPNGBDBM50128052(Allyl-{6-[4-(6-bromo-benzo[d]isothiazol-3-yl)-phen...)
Affinity DataIC50:  1.90E+3nM. Assay description: Inhibitory activity against Oxidosqualene-lanosterol cyclase from human liver microsomes
In DepthDetails ArticlePubMed
TargetSqualene--hopene cyclase(Alicyclobacillus acidocaldarius)
Albert-Ludwigs-University Of Freiburg
Curated by ChEMBL
LigandPNGBDBM50128052(Allyl-{6-[4-(6-bromo-benzo[d]isothiazol-3-yl)-phen...)
Affinity DataIC50:  141nM. Assay description: Inhibitory activity against squalene hopene cyclase from Alicyclobacillus acidocaldarius
TargetLanosterol synthase ERG7(Saccharomyces cerevisiae)
Università
Curated by ChEMBL
LigandPNGBDBM50128052(Allyl-{6-[4-(6-bromo-benzo[d]isothiazol-3-yl)-phen...)
Affinity DataIC50:  280nM. Assay description: Inhibition of yeast OSC expressed in Saccharomyces cerevisiae SMY8
In DepthDetails ArticlePubMed
TargetLanosterol synthase(Homo sapiens (Human))
Albert-Ludwigs-University Of Freiburg
Curated by ChEMBL
LigandPNGBDBM50128052(Allyl-{6-[4-(6-bromo-benzo[d]isothiazol-3-yl)-phen...)
Affinity DataIC50:  1.91E+3nM. Assay description: Inhibition of oxidosqualene cyclase
In DepthDetails ArticlePubMed
TargetLanosterol synthase(Homo sapiens (Human))
Albert-Ludwigs-University Of Freiburg
Curated by ChEMBL
LigandPNGBDBM50128052(Allyl-{6-[4-(6-bromo-benzo[d]isothiazol-3-yl)-phen...)
Affinity DataIC50:  2.03E+4nM. Assay description: Inhibition of human OSC expressed in Saccharomyces cerevisiae SMY8
In DepthDetails ArticlePubMed
TargetLanosterol synthase(Homo sapiens (Human))
Albert-Ludwigs-University Of Freiburg
Curated by ChEMBL
LigandPNGBDBM50128052(Allyl-{6-[4-(6-bromo-benzo[d]isothiazol-3-yl)-phen...)
Affinity DataIC50:  1.91E+3nM. Assay description: Inhibition of oxidosqualene cyclase
In DepthDetails ArticlePubMed
TargetCycloartenol synthase(Arabidopsis thaliana)
Università
Curated by ChEMBL
LigandPNGBDBM50128052(Allyl-{6-[4-(6-bromo-benzo[d]isothiazol-3-yl)-phen...)
Affinity DataIC50:  1.00E+4nM. Assay description: Inhibition of Arabidopsis thaliana cycloartenol synthase expressed in Saccharomyces cerevisiae SMY8
In DepthDetails ArticlePubMed